FrameData
type: Class
subclass of: Restriction
  on property: Obras relacionadas
  max cardinality: 1
subclass of: Restriction
  max cardinality: 1
  on property: Estructura
subclass of: Restriction
  max cardinality: 1
  on property: Estilo/modelo
subclass of: Restriction
  on property: Modelo
  max cardinality: 1
subclass of: Thing
subclass of: Restriction
  on property: Técnica con la que está realizada la inscripción
  max cardinality: 1

Obras relacionadas
type: ObjectProperty
label: Related Objects @en
range: Obras relacionadas
comment: Obras con las que se establecen relaciones del tipo serie, conjunto, parejas, etc.
comment: Related Objects @en
domain: Class
  union of: FrameData
  union of: Obra de arte

Estructura
type: DatatypeProperty
range: string
domain: FrameData
comment: Estructura

Estilo/modelo
type: DatatypeProperty
range: string
comment: Estilo/modelo
domain: FrameData

Modelo
type: DatatypeProperty
domain: Class
  union of: Recurso bibliográfico
  union of: FrameData
comment: Modelo
range: string

Técnica con la que está realizada la inscripción
type: DatatypeProperty
label: Technique with which the inscription is made @en
domain: Class
  union of: Inscripciones
  union of: FrameData
comment: Technique with which the inscription is made @en
comment: Técnica con la que está realizada la inscripción
range: string

Técnica
type: Class
comment: Procedimientos utilizados para la creación de una obra de arte
comment: Procedures used to create an object @en
label: Technique @en

Tipología de la obra
type: Class
comment: Categorías usadas para clasificar la colección de obras de arte: pinturas, esculturas, dibujos, etc.
comment: Types used to classify the collection of works of art: paintings, sculptures, drawings, etc. @en
label: Object classification @en

Medidas
type: Class
comment: Quantifiable numerical values ​​that express the dimension of the object @en
subclass of: Restriction
  on property: Tipo de medida
  max cardinality: 1
subclass of: Thing
comment: Valores numéricos cuantificables que expresan la dimensión del objeto
subclass of: Restriction
  on property: Valor
  max cardinality: 1
subclass of: Restriction
  on property: Factor de conversión
  max cardinality: 1
label: Dimensions @en
subclass of: Restriction
  max cardinality: 1
  on property: Unidad de medida

Tipo de medida
type: DatatypeProperty
comment: Dimension type @en
comment: Tipo de medida
domain: Class
  union of: Medidas
  union of: Filigrana
label: Dimension type @en
range: string

Valor
type: DatatypeProperty
range: float
comment: Number that expresses a measure @en
comment: Número que expresa una medida
label: Has value @en
domain: Medidas

Factor de conversión
type: DatatypeProperty
comment: Ranges of years that must be added or subtracted from dates that are not expressed with figures, p. and. first quarter of a century, etc. @en
comment: Rangos de años que hay que sumar o restar a las dataciones que no se expresan con cifras, p. e. primer cuarto de siglo, etc.
range: string
label: Conversion factor @en
domain: Medidas

Unidad de medida
type: DatatypeProperty
comment: Unit of measure: cm., Mm. gr. etc. @en
comment: Unidad de medida: cm., mm. gr. etc.
range: string
label: Has unit @en
domain: Medidas

Materia
type: Class
label: Medium @en
comment: Materia en la que están realizados los objetos tridimensionales
comment: Medium in which three-dimensional objects are made @en

Filigrana
type: Class
subclass of: Restriction
  on property: Descripción
  max cardinality: 1
subclass of: Restriction
  on property: Cara del papel
  max cardinality: 1
subclass of: Restriction
  cardinality: 1
  on property: Otros identificadores
label: Filigree @en
comment: Filigree @en
subclass of: Restriction
  on property: Otras referencias bibliográficas
  max cardinality: 1
subclass of: Restriction
  on property: Comentario modelo
  max cardinality: 1
subclass of: Restriction
  on property: Es fragmento
  max cardinality: 1
subclass of: Restriction
  on property: Otras medidas tramo
  max cardinality: 1
subclass of: Restriction
  max cardinality: 1
  on property: Corondeles
subclass of: Restriction
  on property: Vertical/Horizontal
  max cardinality: 1
subclass of: Restriction
  on property: Localización
  max cardinality: 1
subclass of: Thing
subclass of: Restriction
  on property: Comentario
  max cardinality: 1
subclass of: Restriction
  on property: Tipo de medida
  max cardinality: 1
subclass of: Restriction
  on property: Tramo entre corondeles
  max cardinality: 1
comment: Filigrana
subclass of: Restriction
  on property: Nombre modelo
  max cardinality: 1

Descripción
type: DatatypeProperty
comment: Description @en
comment: Descripción de características específicas
domain: Class
  union of: Obra de arte
  union of: ObjectInformation
  union of: Intervalo de tiempo
  union of: Inscripciones
  union of: Filigrana
range: string
label: Description @en

Cara del papel
type: DatatypeProperty
comment: Cara del papel
domain: Filigrana
range: string

Otros identificadores
type: DatatypeProperty
domain: Class
  union of: Imagen
  union of: Filigrana
range: string
label: Other identifier @en
comment: Otros identificadores
comment: Is identified by @en

Otras referencias bibliográficas
type: DatatypeProperty
range: string
domain: Filigrana
comment: Otras referencias bibliográficas

Comentario modelo
type: DatatypeProperty
domain: Filigrana
comment: Comentario modelo
range: string

Es fragmento
type: DatatypeProperty
range: boolean
comment: Es fragmento
domain: Filigrana

Otras medidas tramo
type: DatatypeProperty
comment: Otras medidas tramo
range: string
domain: Filigrana

Corondeles
type: DatatypeProperty
comment: Número de corondeles
range: int
domain: Filigrana

Vertical/Horizontal
type: DatatypeProperty
domain: Filigrana
comment: Vertical/Horizontal
range: string

Localización
type: DatatypeProperty
domain: Filigrana
range: string
comment: Localización de los corondeles

Comentario
type: DatatypeProperty
comment: Comentario
range: string
domain: Filigrana

Tramo entre corondeles
type: DatatypeProperty
comment: Tramo entre corondeles
domain: Filigrana
range: int

Nombre modelo
type: DatatypeProperty
range: string
domain: Filigrana
comment: Nombre modelo

Tipo de autoría
type: Class
comment: Relación que se establece entre el autor principal de una obra y otros autores secundarios
comment: Relationship established between the main author of a work and other secondary authors @en
label: Authorship @en

Ceca
type: Class
label: Mint @en
comment: Ciudad o entidad oficial que emite o acuña moneda
comment: Place where it was minted @en

Lugares representados
type: Class
label: Location of the represented place @en
comment: Referencia geográfica a los sitios que aparecen representados en las obras
comment: Depicted places @en

Inscripciones
type: Class
label: Inscriptions @en
comment: Firmas, marcas e inscripciones en la obra de arte
subclass of: Restriction
  on property: Ubicación habitual
  max cardinality: 1
subclass of: Restriction
  on property: Técnica con la que está realizada la inscripción
  max cardinality: 1
subclass of: Restriction
  on property: Descripción
  min cardinality: 1
subclass of: Restriction
  max cardinality: 1
  on property: Descripción
subclass of: Thing
comment: Signatures, Inscriptions, and Markings @en

Ubicación habitual
type: DatatypeProperty
range: string
domain: Inscripciones
comment: Usual location @en
comment: Ubicación habitual
label: Has current permanent location @en

Tema
type: Class
label: Concept @en
comment: Asunto sobre el que versa una obra de arte
comment: Subject on which artwork relates @en

Obra de arte
type: Class
subclass of: Restriction
  on property: Obra con anotación revisada en inglés
  max cardinality: 1
subclass of: Restriction
  max cardinality: 1
  on property: Título de la publicación
subclass of: Restriction
  on property: Procedencia
  max cardinality: 1
subclass of: Restriction
  on property: Número en la Edición / estado
  max cardinality: 1
subclass of: Restriction
  max cardinality: 1
  on property: Transcripción
subclass of: Restriction
  max cardinality: 1
  on property: loanRestrictions
subclass of: Restriction
  on property: acquisitionYear
  max cardinality: 1
subclass of: Restriction
  on property: Idioma
  min cardinality: 1
comment: Man-made artwork @en
subclass of: Thing
label: Artwork @en
subclass of: Restriction
  max cardinality: 1
  on property: Texto con descripción
subclass of: Restriction
  max cardinality: 1
  on property: Obra con anotación revisada en español
subclass of: Restriction
  max cardinality: 1
  on property: Edición / Estado
subclass of: Restriction
  max cardinality: 1
  on property: Imagen principal
subclass of: Restriction
  on property: Texto con lectura aumentada
  max cardinality: 1
subclass of: Restriction
  on property: Idioma
  max cardinality: 2
subclass of: Restriction
  max cardinality: 1
  on property: Longitud
subclass of: Restriction
  on property: Número en la Serie/Colección desnormalizado
  max cardinality: 1
subclass of: Restriction
  max cardinality: 1
  on property: Obras expuestas
subclass of: Restriction
  on property: Código de identificación de la ubicación
  max cardinality: 1
subclass of: Restriction
  on property: Latitud
  max cardinality: 1
subclass of: Restriction
  on property: Fecha de actualización
  max cardinality: 1
subclass of: Restriction
  on property: Título con lectura aumentada
  max cardinality: 1
comment: Objeto artístico creado
subclass of: Restriction
  max cardinality: 1
  on property: Tipo de ubicación
subclass of: Restriction
  max cardinality: 1
  on property: Descripción
subclass of: Restriction
  max cardinality: 1
  on property: Ubicación actual
subclass of: Restriction
  on property: Área o Departamento
  max cardinality: 1
subclass of: Restriction
  on property: Área o Departamento
  max cardinality: 1
subclass of: Restriction
  max cardinality: 1
  on property: Fecha de creación del registro

Obra con anotación revisada en inglés
type: DatatypeProperty
comment: Artwork that carry annotation of augmented reading, already reviewed, in English text @en
comment: Obra que llevan anotación de lectura aumentada, ya revisada, en los textos explicativos en inglés
label: Revised English @en
domain: Obra de arte
range: boolean

Título de la publicación
type: DatatypeProperty
comment: Publication title @en
comment: Título de la publicación
domain: Class
  union of: Recurso bibliográfico
  union of: Obra de arte
range: string
label: Publication title @en

Procedencia
type: DatatypeProperty
label: Provenance @en
domain: Obra de arte
range: string
comment: Provenance @en
comment: Procedencia

Número en la Edición / estado
type: DatatypeProperty
comment: Edition / state Number @en
comment: Número en la Edición / estado
range: string
domain: Obra de arte
label: Edition / state Number @en

Transcripción
type: DatatypeProperty
domain: Obra de arte
range: string
comment: Copy of a text written on the artwork @en
comment: Copia de un texto escrito en la obra de arte
label: Transcription @en

Idioma
type: DatatypeProperty
range: string
domain: Obra de arte
comment: Language @en
comment: Idioma
label: Language @en

Texto con descripción
type: DatatypeProperty
label: Text with explanation @en
range: string
comment: Text with explanation @en
comment: Texto explicativo
domain: Class
  union of: Obra de arte
  union of: Imagen

Obra con anotación revisada en español
type: DatatypeProperty
comment: Artwork that carry annotation of augmented reading, already reviewed, in Spanish text @en
comment: Obra que lleva anotación de lectura aumentada, ya revisada, en los textos explicativos en español
range: boolean
domain: Obra de arte
label: Revised Spanish @en

Edición / Estado
type: DatatypeProperty
label: Edition / State @en
domain: Obra de arte
range: string
comment: Multiple impressions printed from the same matrix @en
comment: Nombre de la colección limitada y numerada de copias iguales de una misma plancha para obtener una estampa

Imagen principal
type: DatatypeProperty
range: string
comment: Main image @en
comment: Imagen principal del objeto
domain: Obra de arte
label: Main image @en

Texto con lectura aumentada
type: DatatypeProperty
comment: Text with augmented reading @en
comment: Texto con lectura aumentada
range: string
domain: Obra de arte
label: Text with augmented reading @en

Longitud
type: DatatypeProperty
comment: Geographic coordinate that expresses the east- west position of the object's location @en
comment: Coordenada geográfica que expresa la posición este u oeste de la ubicación del objeto
label: Long @en
domain: Obra de arte
range: string

Número en la Serie/Colección desnormalizado
type: DatatypeProperty
comment: Número en la Serie/Colección desnormalizado
domain: Obra de arte
range: string

Obras expuestas
type: DatatypeProperty
range: string
domain: Obra de arte
comment: Obras cuyo tipo de ubicación es expuestas
comment: On display @en
label: On display @en

Código de identificación de la ubicación
type: DatatypeProperty
comment: Location identification code @en
comment: Código numérico que se le asigna a cada nombre de una ubicación
range: string
label: Location identification code @en
domain: Obra de arte

Latitud
type: DatatypeProperty
domain: Obra de arte
label: Lat @en
range: string
comment: Geographic coordinate that expresses the north-south position of the object's location @en
comment: Coordenada geográfica que expresa la posición norte o sur de la ubicación del objeto

Fecha de actualización
type: DatatypeProperty
comment: Date of last update @en
comment: Fecha última actualización
label: Update date @en
domain: Obra de arte
range: date

Título con lectura aumentada
type: DatatypeProperty
range: string
comment: Has title wiht augmented reading @en
comment: Título de una obra con lectura aumentada
label: Has title augmented @en
domain: Obra de arte

Tipo de ubicación
type: DatatypeProperty
label: Has current location type @en
domain: Obra de arte
range: string
comment: Location type @en
comment: Categorías en que se dividen las ubicaciones: expuesto, en almacén, etc.

Ubicación actual
type: DatatypeProperty
domain: Obra de arte
comment: Current location @en
comment: Ubicación actual
range: string
label: Current location @en

Área o Departamento
type: DatatypeProperty
range: string
comment: Nombre del área o departamento del museo que gestiona la obra
comment: Name of the area or department of the museum that manages the work @en
label: Departament name @en
domain: Obra de arte

Área o Departamento
type: DatatypeProperty
domain: Obra de arte
range: string
comment: Department of the museum that manages the work @en
comment: Área o departamento del museo que gestiona la obra
label: DepartmentId @en

Fecha de creación del registro
type: DatatypeProperty
label: Registry created on @en
domain: Obra de arte
range: date
comment: Date of publication of a object on web @en
comment: Fecha de publicación de una obra en web

Fauna representada
type: Class
label: Depicted fauna @en
comment: Cualquier tipo de animal que aparece representado en una obra de arte
comment: Any animal that is represented in an artwork @en

Lugar de producción
type: Class
comment: Referencia al sitio geográfico donde el objeto ha sido creado o fabricado
comment: Reference to the geographic site where the object was created or manufactured @en
label: Place of origin @en

Autor de la obra de arte
type: Class
label: Author of the artwork @en
subclass of: Restriction
  on property: Orden
  max cardinality: 1
subclass of: Thing
comment: Nombre del creador de una obra de arte
comment: Artwork creator @en

Orden
type: DatatypeProperty
label: Order @en
range: string
comment: Orden
comment: Order @en
domain: Autor de la obra de arte

Obras relacionadas
type: Class
label: Related Objects @en
comment: Obras creadas por el mismo autor o que tienen un origen común
comment: Objects created by the same author or that have a common origin @en

Flora representada
type: Class
label: Flora represented @en
comment: Cualquier especie vegetal reproducida en una obra de arte
comment: Flora depicted @en

Escuela artística
type: Class
comment: Espacio geográfico donde se ha formado un autor, que generalmente se identifica con un país o ciudad
comment: Geographic space where an author has been trained, which is generally identified with a country or city @en
label: School (Art movement) @en

Número de inventario
type: Class
label: Inventory number @en
subclass of: Thing
subclass of: Restriction
  on property: Número de inventario antiguos
  max cardinality: 1
comment: Número asignado de manera única a una obra
subclass of: Restriction
  on property: Precisiones a la datación
  max cardinality: 1
subclass of: Restriction
  max cardinality: 1
  on property: Nombre del inventario
subclass of: Restriction
  max cardinality: 1
  on property: Texto de inventario
comment: Inventory number @en

Número de inventario antiguos
type: DatatypeProperty
range: string
comment: Old Inventory Numbers @en
comment: Número de inventario antiguos
domain: Número de inventario
label: Old Inventory Numbers @en

Precisiones a la datación
type: DatatypeProperty
domain: Número de inventario
comment: Interval between two dates @en
comment: Intervalo de tiempo entre dos fechas
label: Has time-span @en
range: date

Nombre del inventario
type: DatatypeProperty
range: string
label: Inventory name @en
comment: Inventory name @en
comment: Nombre del inventario
domain: Número de inventario

Texto de inventario
type: DatatypeProperty
domain: Número de inventario
comment: Has Inventory text @en
comment: Contiene texto del inventario
label: Inventory text @en
range: string

Intervalo de tiempo
type: Class
comment: Extensión temporal de un periodo, que permite marcar rangos de tiempos
comment: Time interval, which allows marking time ranges @en
label: Time Span @en

Objetos representados
type: Class
comment: Elementos identificables que aparecen reproducidos en las obras
comment: Identifiable elements that are represented in artworks @en
label: Objects Depicted @en

Soporte
type: Class
comment: Elemento sobre cuya superficie se realiza una obra de arte bidimensional, como el lienzo, papel, tabla
comment: Element on whose surface a two-dimensional work of art is made, such as canvas, paper @en
label: Support @en

Recurso bibliográfico
type: Class
subclass of: Restriction
  max cardinality: 1
  on property: Editor de la publicación
subclass of: Restriction
  on property: Publication type
  max cardinality: 1
subclass of: Restriction
  on property: Sede de expedición
  max cardinality: 1
label: References @en
comment: A wide range of materials, including books, periodicals. @en
subclass of: Restriction
  on property: Modelo
  max cardinality: 1
subclass of: Restriction
  on property: Año de publicación
  max cardinality: 1
comment: Materiales en los que se encarnación físicamente un recurso bibliográfico, incluidos manuscritos, libros, carteles, grabaciones de sonido, películas, grabaciones de video, kits multimedia, etc
subclass of: Thing
subclass of: Restriction
  on property: Lugar de edición de una publicación
  max cardinality: 1
subclass of: Restriction
  on property: Título de una publicación tipo colección
  max cardinality: 1
subclass of: Restriction
  max cardinality: 1
  on property: Título de la publicación
subclass of: Restriction
  max cardinality: 1
  on property: Páginas
subclass of: Restriction
  max cardinality: 1
  on property: Volumen

Editor de la publicación
type: DatatypeProperty
domain: Recurso bibliográfico
comment: Publication editor @en
comment: Editor de la publicación
range: string
label: Publication editor @en

Publication type
type: DatatypeProperty
domain: Recurso bibliográfico
comment: Categories in which bibliographic resources are classified: monographs, exhibition catalogs or periodicals @en
comment: Categorías en que se clasifican los recursos bibliográficos: monografías, catálogos de exposición o publicaciones periódicas
label: Tipo de publicación @en
range: string

Sede de expedición
type: DatatypeProperty
comment: Place of the exhibition @en
comment: Lugar en el que se celebra una exposición
label: Place of the exhibition @en
range: string
domain: Recurso bibliográfico

Año de publicación
type: DatatypeProperty
comment: Date of publication or distribution
comment: Año de publicación de un recurso bibliográfico @en
label: Date of publication or distribution @en
range: string
domain: Recurso bibliográfico

Lugar de edición de una publicación
type: DatatypeProperty
comment: Place of publication @en
comment: Lugar de edición de una publicación
label: Place of publication @en
domain: Recurso bibliográfico
range: string

Título de una publicación tipo colección
type: DatatypeProperty
domain: Recurso bibliográfico
label: Journal Title @en
range: string
comment: Title of a publication with several authors, be it a magazine, a conference or an exhibition catalog @en
comment: Título de una publicación con varios autores, sea una revista, un congreso o un catálogo de exposición

Páginas
type: DatatypeProperty
domain: Recurso bibliográfico
range: string
comment: Pages of a publication or bibliographic resource @en
comment: Páginas de una publicación o recurso bibliográfico
label: Pages @en

Volumen
type: DatatypeProperty
domain: Recurso bibliográfico
range: string
comment: Volume (bibliographic reference) @en
comment: Volumen de un recurso bibliográfico
label: Volume @en

Entidad
type: Class
label: Entity @en
comment: Todo aquello cuya existencia es reconocida por la ontología, personas, lugares, instituciones o cosas
comment: Everything whose existence is recognized by the ontology, people, places, institutions or things @en

Imagen
type: Class
comment: Thing that carry the same visual symbols, marks or images as a logo @en
subclass of: Restriction
  max cardinality: 1
  on property: Altura de la imagen
subclass of: Restriction
  on property: Texto con descripción
  max cardinality: 1
subclass of: Restriction
  max cardinality: 1
  on property: Fuente de luz
comment: Imagen
subclass of: Restriction
  max cardinality: 1
  on property: Tipo
subclass of: Restriction
  max cardinality: 1
  on property: Anchura de la imagen
subclass of: Restriction
  on property: Image View
  max cardinality: 1
subclass of: Thing
label: Visual item @en
subclass of: Restriction
  on property: Otros identificadores
  max cardinality: 1
subclass of: Restriction
  on property: Es imagen principal
  max cardinality: 1

Altura de la imagen
type: DatatypeProperty
label: Image Height @en
comment: Image Height @en
comment: Altura de la imagen
domain: Imagen
range: string

Fuente de luz
type: DatatypeProperty
range: string
label: Image Light Source @en
domain: Imagen
comment: Light source in photographs @en
comment: Fuente de luz con la que se ha tomado una fotografía

Tipo
type: DatatypeProperty
domain: Imagen
label: Has type @en
comment: Has type @en
comment: Tipo
range: string

Anchura de la imagen
type: DatatypeProperty
label: Image Width @en
domain: Imagen
range: string
comment: Image Width @en
comment: Anchura de la imagen

Image View
type: DatatypeProperty
domain: Imagen
range: string
comment: Image @en
comment: Imagen
label: Image @en

Es imagen principal
type: DatatypeProperty
comment: Es imagen principal
domain: Imagen
range: boolean

Producto
type: ObjectProperty
comment: Objetos disponibles para la venta en tienda
comment: Items available for sale in the museum shop @en
domain: Obra de arte
label: Art work product @en

Tabla jerárquica de Flora
type: ObjectProperty
label: Flora Node @en
domain: Flora representada
comment: Listado de términos de especie vegetales reproducidas en una obra de arte
comment: Controlled vocabulary with the name of the depicted plants in the artwork @en

Tabla jerárquica de Materias
type: ObjectProperty
domain: Materia
label: The hierarchical structure of Medium @en
comment: Listado de términos de las materias en la que están realizados los objetos tridimensionales
comment: List of terms of the mediums in which the three-dimensional objects are made @en

Tabla jerárquica de soportes
type: ObjectProperty
label: Support Node @en
comment: Listado de términos de elementos sobre cuya superficie se realiza una obra de arte bidimensional, como el lienzo, papel, tabla
comment: Controlled vocabulary with the name of the support @en
domain: Soporte

Materia de una obra de arte
type: ObjectProperty
domain: Obra de arte
comment: Materiales utilizados para crear una obra de arte tridimensional
comment: Materials used to create a three-dimensional artwork @en
range: Materia
label: Medium employed @en

Ceca
type: ObjectProperty
domain: Obra de arte
label: Mint @en
comment: Nombre de la entidad oficial que emite o acuñaba moneda
comment: Name of mint that minted currency @en
range: Ceca

Información del objeto
type: ObjectProperty
range: ObjectInformation
label: Has object information @en
comment: Información del objeto
comment: Has object information @en
domain: Objetos representados

Flora relacionada
type: ObjectProperty
comment: Flora Depicted @en
comment: Flora representada en la obra
label: Flora Depicted @en
domain: Obra de arte
range: Flora representada

Entidad tipo Cosa
type: ObjectProperty
label: About Entity Thing @en
range: Entidad
comment: Nombres de acontecimientos o conceptos abstractos recogidos en Wikidata
comment: Category that gathers the names of events or things collected in Wikidata @en
domain: Obra de arte

Motivos decorativos
type: ObjectProperty
comment: Motivos decorativos
domain: FrameData
range: DecorationFramePath

Signoguía
type: ObjectProperty
comment: Signguide @en
comment: Signoguía
label: Signguide @en
domain: Obra de arte

Filigrana
type: ObjectProperty
domain: Obra de arte
range: Filigrana
comment: Filigrana
comment: Filigree @en
label: Filigree @en

Firmas, marcas, inscripciones
type: ObjectProperty
range: Inscripciones
domain: Obra de arte
comment: Información breve pintada, impresa o grabada sobre una obra de arte
comment: Brief information painted, printed or engraved on an artwork @en
label: Signatures, Inscriptions, and Markings @en

Lugar de producción
type: ObjectProperty
range: Lugar de producción
domain: Obra de arte
label: Place of origin @en
comment: Fabrication place @en
comment: Lugar en que una obra ha sido creada

Imagen
type: ObjectProperty
domain: Class
  union of: Obra de arte
  union of: Filigrana
  union of: FrameData
range: Imagen
comment: Picture @en
comment: Imagen
label: Picture @en

Fauna representada
type: ObjectProperty
range: Fauna representada
label: Fauna Depicted @en
comment: Animales que aparecen representados en una obra de arte
comment: Fauna Depicted @en
domain: Obra de arte

Técnica
type: ObjectProperty
label: Technique @en
comment: Técnicas utilizados en la creación de una obra de arte
comment: Techniques used to create an object @en
range: Técnica
domain: Obra de arte

Tabla jerárquica de Fauna representada
type: ObjectProperty
label: Fauna Node @en
domain: Fauna representada
comment: Listado de nombres de animales que aparecen representados en una obra de arte
comment: Controlled vocabulary with the name of the depicted wildlife @en

Participación en exposición temporal
type: ObjectProperty
label: Was present at exhibition @en
comment: Indica que la obra ha formado parte de una exposición temporal
comment: The art work has been part of a temporary exhibition @en
domain: Obra de arte

Recurso multimedia
type: ObjectProperty
label: Artwork multimedia resource @en
comment: Materiales multimedia que aúnan imágenes y sonido
comment: Artwork multimedia resource @en
domain: Obra de arte

Tabla jerárquica de Lugares representados
type: ObjectProperty
label: Place Node @en
comment: Listado de términos de lugares o sitios que aparecen representados en las obras
comment: Controlled vocabulary with the name of the places or sites depicted in the artworks @en
domain: Lugares representados

Tabla jerárquica de tipos de objetos
type: ObjectProperty
domain: Tipología de la obra
label: List of terms of art works types @en
comment: Listado de términos de la tipología de las obras de arte de la colección
comment: List of terms of the typology of the art works in the collection @en

Frame
type: ObjectProperty
comment: Marco relacionado
label: Marco @en
domain: Obra de arte

Personajes representados
type: ObjectProperty
domain: Obra de arte
comment: Personajes representados en una obra
comment: Person Depicted @en
label: Person Depicted @en

Tabla jerárquica de Cecas
type: ObjectProperty
comment: Listado de términos con el nombre de ciudades o entidades que emiten moneda
comment: Controlled vocabulary with the name of the mints @en
domain: Ceca
label: Place ceca node @en

Participación en exposiciones
type: ObjectProperty
domain: Obra de arte
comment: Exhibition History @en
comment: Formó parte de una exposición
label: Related Exhibition @en

Otros identificadores
type: ObjectProperty
range: Número de inventario
domain: Obra de arte
label: Is identified by @en
comment: Identification of any object by an identifier number @en
comment: Otros identificadores

Autor
type: ObjectProperty
range: Autor de la obra de arte
comment: Carried out by @en
comment: Hecho por
label: Author @en
domain: Obra de arte

Audioguía
type: ObjectProperty
label: Audio guide @en
comment: Audio guide @en
comment: Audioguía
domain: Obra de arte

Periodo de tiempo
type: ObjectProperty
domain: Obra de arte
range: Intervalo de tiempo
comment: Intervalo de tiempo entre dos fechas
comment: Has time span @en
label: Time span @en

Has type
type: ObjectProperty
comment: Subtype of specialization, through the use of a terminological hierarchy @en
comment: Rol del autor en la obra
domain: Obra de arte
label: Rol del autor en la obra @en
range: Tipología de la obra

Entidad tipo Lugar
type: ObjectProperty
domain: Obra de arte
comment: Categoría que reúne los nombres de lugares, sitios o espacios recogidos en Wikidata
comment: Category that brings the names of places collected in Wikidata @en
label: About Entity Place @en
range: Entidad

Obras realizadas por un autor
type: ObjectProperty
comment: Obras creadas por un autor
comment: Works made by an author @en
label: Author artwork @en
domain: Obra de arte

Tabla jerárquica de Temas
type: ObjectProperty
label: The hierarchical structure of Concepts @en
domain: Tema
comment: Listado de términos de los temas representados en la obra
comment: Controlled vocabulary with the name of the depicted concepts in the artwork @en

Soporte de una obra de arte
type: ObjectProperty
domain: Obra de arte
comment: Materiales sobre los que se ha realizado una obra de arte bidimensional
comment: Materials on which a two-dimensional artwork has been made @en
label: Support Employed @en
range: Soporte

Escuela asignada a la obra
type: ObjectProperty
comment: Valor de la tabla de Escuelas asignada a una obra
comment: Schools (Art movement) assigned to a work @en
label: Has school @en
domain: Obra de arte
range: Escuela artística

Tabla jerárquica de objetos representados
type: ObjectProperty
label: List of terms of objects depicted @en
domain: Objetos representados
comment: Listado de términos de objetos que aparecen reproducidos en las obras
comment: List of terms of objects that appear depicted in the artwork @en

Medidas
type: ObjectProperty
label: Dimension @en
comment: Medidas
comment: Has dimension @en
range: Medidas
domain: Class
  union of: Obra de arte
  union of: Filigrana

Tipo de autoría
type: ObjectProperty
range: Tipo de autoría
label: Authorship @en
domain: Autor de la obra de arte
comment: Relación que se establece entre el autor principal de una obra y otros autores secundarios
comment: Relationship established between the main author of a work and other secondary authors @en

Tema
type: ObjectProperty
domain: Obra de arte
label: Tema o asuntos representados en las obras @en
range: Tema
comment: Temas representados @en
comment: Subjects Depicted

Objetos representados
type: ObjectProperty
domain: Obra de arte
comment: Objetos o elementos representados en una obra
comment: Object Depicted @en
range: Objetos representados
label: Object Depicted @en

Datos específicos
type: ObjectProperty
label: Specific data @en
domain: Obra de arte
range: FrameData

Entidad tipo Persona
type: ObjectProperty
comment: Categoría que aúna los nombres de personas recogidas en Wikidata
comment: Category that brings together the names of people collected in Wikidata @en
range: Entidad
label: About Entity Person @en
domain: Obra de arte

Related collection page
type: ObjectProperty
label: Publicación relacionada
domain: Obra de arte

Bibliografía
type: ObjectProperty
domain: Class
  union of: Obra de arte
  union of: Filigrana
comment: Bibliographic reference @en
comment: Bibliografía
label: Bibliographic reference @en
range: Recurso bibliográfico

Voz de la Enciclopedia del Museo del Prado
type: ObjectProperty
comment: Recurso existente en la Enciclopedia del Museo del Prado relacionado con una obra
comment: Resource in the Prado Museum Encyclopedia related to an artwork @en
label: Artwork Encyclopedia Entry @en
domain: Obra de arte

Entidad tipo Organización
type: ObjectProperty
comment: Nombres de instituciones recogidas en Wikidata
comment: Categorie assigned to the Wikidata type Organization @en
label: About Entity Organization @en
domain: Obra de arte
range: Entidad

Lugares representados
type: ObjectProperty
label: Place Depicted @en
comment: Sitios o lugares representados en una obra
comment: Place Depicted @en
domain: Obra de arte
range: Lugares representados

Imágenes modelo
type: ObjectProperty
domain: Filigrana
comment: Imágenes modelo
range: Imagen

Exposición
type: ObjectProperty
domain: Obra de arte
label: Exhibition History @en
comment: Título de una exposición en la que haya participado la obra
comment: Title of an exhibition in which the work has participated @en

Entidad de Wikipedia
type: ObjectProperty
comment: Todo concepto reconocido por Wikipedia: personas, lugares, instituciones o cosas
comment: Anything are concepts of existence in Wikipedia @en
label: Entity Wikipedia @en
domain: Obra de arte

Tabla jerárquica de Técnicas
type: ObjectProperty
comment: Listado de términos de técnicas utilizados para la creación de una obra de arte
comment: Controlled vocabulary with the name of the technique @en
domain: Técnica
label: Technique Node @en

Obra
type: ObjectProperty
domain: Obras relacionadas
comment: Objeto que forma parte de la colección del Museo
comment: Object of the Museum's collection @en
label: Art work @en

Número de inventario
type: ObjectProperty
range: Número de inventario
label: Accession Number @en
domain: Obra de arte
comment: Número de inventario
comment: Accession Number @en

Autor
type: ObjectProperty
label: Author @en
domain: Class
  union of: Autor de la obra de arte
  union of: Tipo de autoría
comment: Person who has created an artwork @en
comment: Persona que ha creado una obra

Tabla jerárquica Lugares de producción
type: ObjectProperty
label: Place Node @en
domain: Lugar de producción
comment: Listado de términos que hacen referencia al sitio geográfico donde el objeto ha sido creado o fabricado
comment: Controlled vocabulary with the name of the fabrication place @en

Tabla jerárquica de Escuelas artísticas
type: ObjectProperty
domain: Escuela artística
comment: Listado de términos que hacen referencia al espacio geográfico donde se ha formado un autor
comment: Controlled vocabulary with the name of the schools (Art movement) @en
label: School Node @en

Tipo de autoría
type: DatatypeProperty
range: string
label: Has type authorship @en
domain: Tipo de autoría
comment: Relación que se establece entre el autor principal de una obra y otros autores secundarios
comment: Relationship established between the main author of a artwork and other secondary authors @en

Serie/Colección
type: DatatypeProperty
range: string
label: Series / Collection @en
comment: Set of artworks gathered by being part of the same commission. They can be created by the same person or different. @en
comment: Conjunto de obras reunidas por ser parte de un mismo encargo. Pueden estar creadas por una misma persona o diferentes.
domain: Obra de arte

URL
type: DatatypeProperty
range: string
comment: Record URL @en
comment: URL
domain: Recurso bibliográfico

Etiqueta
type: DatatypeProperty
comment: Filters to select different categories related to artworks @en
comment: Filtros para seleccionar diferentes categoría relativas a las obras de arte
domain: Obra de arte
range: string
label: Tag @en

Autor del documento
type: DatatypeProperty
label: Document author @en
domain: Recurso bibliográfico
comment: Document author @en
comment: Autor del documento
range: string

Relevancia
type: DatatypeProperty
range: int
comment: Relevance @en
comment: Relevancia
domain: Obra de arte
label: Relevance @en

Fecha de inicio
type: DatatypeProperty
label: Has time-span beginning @en
comment: Time-span beginning @en
comment: Fecha de inicio
domain: Class
  union of: Obra de arte
  union of: Intervalo de tiempo
range: date

Relación
type: DatatypeProperty
comment: Relation @en
comment: Relación
label: Relation @en
domain: Obras relacionadas
range: string

Texto de la datación
type: DatatypeProperty
comment: Literal que matiza o precisa una datación, p. e. hacia, antes de
comment: Literal that qualifies or specifies a dating such as towards, before @en
range: string
label: Dating text @en
domain: ObjectInformation

Particularidades de uso de los objetos representados
type: DatatypeProperty
range: string
domain: ObjectInformation
comment: Particularidades de uso de los objetos representados
comment: Usage particularities of the use of the depicted objects @en
label: Usage particularities @en

Datación
type: DatatypeProperty
label: Date @en
comment: Fecha de creación de un objeto
comment: Creation date of an object @en
domain: Class
  union of: Obra de arte
  union of: Intervalo de tiempo
range: string

Fecha de fin
type: DatatypeProperty
range: date
label: Has time-span end @en
comment: Time-span end @en
comment: Fecha de fin
domain: Class
  union of: Obra de arte
  union of: Intervalo de tiempo

Tipo de autor
type: DatatypeProperty
comment: Modality in which the author is a specialist: painter, sculptor... @en
comment: Modalidad en la que el autor es especialista: pintor, escultor...
domain: Autor de la obra de arte
label: Has author type @en
range: string

Imagen
type: DatatypeProperty
domain: Obra de arte
range: string
label: Visual item @en
comment: Picture @en
comment: Imagen

Lugar de producción
type: DatatypeProperty
range: string
comment: Fabrication place @en
comment: Lugar en que una obra ha sido creada
domain: ObjectInformation
label: Place of origin @en

Número de inventario
type: FunctionalProperty
label: Accession Number @en
range: string
domain: Obra de arte
comment: Número que identifica al objeto en la colección del Museo
comment: Accession Number @en
type: DatatypeProperty

Obra procesada en inglés
type: FunctionalProperty
comment: Artwork that carry annotation of augmented reading in English text @en
comment: Obra que lleva anotación de lectura aumentada en los textos explicativos en inglés
range: boolean
label: Artwork processed in English @en
type: DatatypeProperty
domain: Obra de arte

Descripción
type: FunctionalProperty
range: string
comment: Descripción
domain: Obra de arte

Entidad
type: FunctionalProperty
domain: Entidad
label: Something (concept) @en
type: ObjectProperty
comment: Concepts of existence in ontology: people, places, institutions or things @en
comment: Todo aquello cuya existencia es reconocida por la ontologia: personas, lugares, instituciones o cosas

Obra procesada en español
type: FunctionalProperty
label: Artwork processed in Spanish @en
type: DatatypeProperty
range: boolean
domain: Obra de arte
comment: Artwork that carry annotation of augmented reading in English text Spanish @en
comment: Obra que lleva anotación de lectura aumentada en los textos explicativos en español

Obras destacadas
type: FunctionalProperty
type: DatatypeProperty
label: Prominent @en
domain: Obra de arte
comment: Outstanding artwork @en
comment: Destacada
range: boolean

Título
type: FunctionalProperty
comment: Title @en
comment: Título
domain: Obra de arte
range: string
label: Title @en
type: DatatypeProperty

Orden
type: FunctionalProperty
label: Order @en
comment: Orden
comment: Order @en
type: DatatypeProperty
domain: Class
  union of: Soporte
  union of: Filigrana
range: int

Número de inventario principal
type: FunctionalProperty
comment: Main Inventory number @en
comment: Número de inventario principal
range: string
label: Accession Number @en
domain: Inscripciones
type: DatatypeProperty